{"text_format":"1","workbook":"xlsx","n_sheets":14,"sheets":["Income","Benefits_&_Tax_Credits","Housing_&_Utilities","Other_Household_Expenditure","Housekeeping_&_Health","Leisure_&_Clothing","Travel","Debts_&_Loans","Children","Savings_&_Giving","Miscellaneous","Financial_Overview","Debt_Reduction_Calculator","Payment_Schedule"],"not_rendered":{"charts":1,"images":23,"macros":1,"external_links":1,"defined_names":2,"comments":1,"pivot_tables":0},"unopened":[],"bounds":{"document_bytes":16777216,"sheet_cells":100000,"rows_first":2000,"rows_last":500,"rows_between":2000,"halvings":0,"cell_chars":16384,"cell_head_chars":4096},"cells_cut":0,"cells_raw":0,"read":"whole","date_system":"1900"}

{"sheet":"Income","index":0,"n_rows":36,"n_cols":3,"rows_kept":36,"cut":false,"hidden":false,"merged":[[7,1,8,1],[7,2,8,2],[16,1,17,1],[16,2,17,2],[26,1,27,1],[26,2,27,2]]}
[]
[null,"Income"]
[]
[null,"Please provide details of all income after tax has been deducted."]
[]
[null,"Salary/Wages"]
[]
[null,"Description","Amount £"]
[]
[null,"My 'take home' Salary/Wages",0]
[null,"Partner's 'take home' Salary/Wages",0]
[null,"Income from Self-employment",0]
[null,"Salary/Wages Total:",{"$f":"SUM(C10:C12)","v":0}]
[]
[null,"Pension"]
[]
[null,"Description","Amount £"]
[]
[null,"My State Pension",0]
[null,"Partner's State Pension",0]
[null,"My Private Pension",0]
[null,"Partner's Private Pension",0]
[null,"Pensions Total:",{"$f":"SUM(C19:C22)","v":0}]
[]
[null,"Other Income"]
[]
[null,"Description","Amount £"]
[]
[null,"Income received from Child Maintenance payments",0]
[null,"Income from lodgers",0]
{"$rows_left_out":7}
{"sheet":"Benefits_&_Tax_Credits","index":1,"n_rows":18,"n_cols":3,"rows_kept":18,"cut":false,"hidden":false,"merged":[[5,1,6,1],[5,2,6,2]]}
[]
[null,"Benefits & Tax Credits"]
[]
[null,"Please provide details of all benefits or tax credits."]
[]
[null,"Description","Amount £"]
[]
[null,"Jobseeker's Allowance",0]
[null,"Income Support",0]
[null,"Working Tax Credit",0]
[null,"Child Benefit",0]
[null,"Child Tax Benefit",0]
[null,"Incapacity Benefit or Sick Pay",0]
[null,"Disability Benefits",0]
[null,"Carer's Allowence ",0]
[null,"Council Tax Benefit",0]
[null,"Housing Benefits",0]
[null,"Benefits & Tax Credits Total:",{"$f":"SUM(C8:C17)","v":0}]

{"sheet":"Housing_&_Utilities","index":2,"n_rows":20,"n_cols":3,"rows_kept":20,"cut":false,"hidden":false,"merged":[[5,1,6,1],[5,2,6,2]]}
[]
[null,"Housing & Utilities"]
[]
[null,"Please provide details of all housing and utility expenses."]
[]
[null,"Description","Amount £"]
[]
[null,"Mortgage",0]
[null,"Mortgage on second property",0]
[null,"Endownments or savings linked to mortgage",0]
[null,"Rent",0]
[null,"Ground Rent and/or Services Charges",0]
[null,"Gas",0]
[null,"Electricity",0]
[null,"Water",0]
[null,"Building Insurance",0]
[null,"Contents Insurance",0]
[null,"Council Tax",0]
[null,"Household Maintenance / Repair",0]
[null,"Housing & Utilities Total:",{"$f":"SUM(C8:C19)","v":0}]

{"sheet":"Other_Household_Expenditure","index":3,"n_rows":36,"n_cols":3,"rows_kept":36,"cut":false,"hidden":false,"merged":[[7,1,8,1],[7,2,8,2],[17,1,18,1],[17,2,18,2],[26,1,27,1],[26,2,27,2]]}
[]
[null,"Other Household Expenditure"]
[]
[null,"Please provide details of all other household expenses."]
[]
[null,"Telephone"]
[]
[null,"Description","Amount £"]
[]
[null,"Telephone Line Rental",0]
[null,"Telephone Call Charges",0]
[null,"Mobile Phone Contract",0]
[null,"Mobile Phone Call/Text Charges",0]
[null,"Telephone Total:",{"$f":"SUM(C10:C13)","v":0}]
[]
[null,"TV & Internet"]
[]
[null,"Description","Amount £"]
[]
[null,"TV Licence",0]
[null,"Internet",0]
[null,"Cable / Satellite TV",0]
[null,"TV & Internet Total:",{"$f":"SUM(C20:C22)","v":0}]
[]
[null,"Insurance, Warranties & Pension"]
[]
[null,"Description","Amount £"]
[]
[null,"Travel Insurance",0]
[null,"Life Assurance",0]
{"$rows_left_out":7}
{"sheet":"Housekeeping_&_Health","index":4,"n_rows":36,"n_cols":3,"rows_kept":36,"cut":false,"hidden":false,"merged":[[7,1,8,1],[7,2,8,2],[19,1,20,1],[19,2,20,2],[29,1,30,1],[29,2,30,2]]}
[]
[null,"Housekeeping & Health"]
[]
[null,"Please provide details of all housekeeping and health expenses."]
[]
[null,"Food & Drink"]
[]
[null,"Description","Amount £"]
[]
[null,"Food & Drink (not pub / meals out)",0]
[null,"Coffees, snacks etc (not meals out)",0]
[null,"Meals at Work",0]
[null,"Alcohol",0]
[null,"Cigarettes",0]
[null,"Pet food",0]
[null,"Food & Drink Total:",{"$f":"SUM(C10:C15)","v":0}]
[]
[null,"Cleaning & Toiletries"]
[]
[null,"Description","Amount £"]
[]
[null,"Cleaning & Toiletries",0]
[null,"Other Cleaning costs",0]
[null,"Toiletries",0]
[null,"Laundry & dry cleaning",0]
[null,"Cleaning & Toiletries Total:",{"$f":"SUM(C22:C25)","v":0}]
[]
[null,"Health"]
[]
[null,"Description","Amount £"]
{"$rows_left_out":7}
{"sheet":"Leisure_&_Clothing","index":5,"n_rows":19,"n_cols":3,"rows_kept":19,"cut":false,"hidden":false,"merged":[[7,1,8,1],[7,2,8,2]]}
[]
[null,"Leisure & Clothing"]
[]
[null,"Please provide details of all your leisure & clothing expenses."]
[]
[null,"Leisure & Clothing"]
[]
[null,"Description","Amount £"]
[]
[null,"Fitness / Gym",0]
[null,"Sports subscriptions",0]
[null,"Clothing",0]
[null,"Shoes",0]
[null,"Newspapers / Magazines",0]
[null,"Leisure Activities",0]
[null,"Hobbies",0]
[null,"Pub",0]
[null,"Meals out",0]
[null,"Leisure & Clothing Total:",{"$f":"SUM(C10:C18)","v":0}]

{"sheet":"Travel","index":6,"n_rows":26,"n_cols":3,"rows_kept":26,"cut":false,"hidden":false,"merged":[[7,1,8,1],[7,2,8,2],[17,1,18,1],[17,2,18,2]]}
[]
[null,"Travel"]
[]
[null,"Please provide details of all your Travel expenses."]
[]
[null,"Public Transport"]
[]
[null,"Description","Amount £"]
[]
[null,"Travel card / Season Ticket",0]
[null,"Other Regular Public Transport",0]
[null,"One-off trips",0]
[null,"Taxis",0]
[null,"Public Transport Total:",{"$f":"SUM(C10:C13)","v":0}]
[]
[null,"Motoring"]
[]
[null,"Description","Amount £"]
[]
[null,"Road Tax",0]
[null,"Car / Motorbike Insurance",0]
[null,"Petrol",0]
[null,"MOT / Servicing",0]
[null,"Breakdown Cover",0]
[null,"Parking charges (not fines or tolls)",0]
[null,"Motoring Total:",{"$f":"SUM(C20:C25)","v":0}]

{"sheet":"Debts_&_Loans","index":7,"n_rows":17,"n_cols":5,"rows_kept":17,"cut":false,"hidden":false,"merged":[[7,1,8,1],[7,2,8,2],[7,3,8,3],[7,4,8,4]]}
[]
[null,"Debts & Loans"]
[]
[null,"Please provide details of all your debt and loan payments."]
[]
[null,"Debts & Loans"]
[]
[null,"Description","Amount £","Interest Rate","Remaining Debt/Loan Balance"]
[]
[null,"Loan repayments for loans secured on your home",0,0,0]
[null,"Car loan repayments",0,0,0]
[null,"Hire Purchase / Leasing payments",0,0,0]
[null,"Other unsecured loan repayments",0,0,0]
[null,"Payments to Reduce Overdraft",0,0,0]
[null,"Credit / Store Card repayments",0,0,0]
[null,"Bank / Overdraft Charges",0,0,0]
[null,"Debts & Loans Total:",{"$f":"SUM(C10:C16)","v":0}]

{"sheet":"Children","index":8,"n_rows":21,"n_cols":3,"rows_kept":21,"cut":false,"hidden":false,"merged":[[7,1,8,1],[7,2,8,2]]}
[]
[null,"Children"]
[]
[null,"Please provide details of all payments related to children you are responsible for."]
[]
[null,"Children"]
[]
[null,"Description","Amount £"]
[]
[null,"Nappies",0]
[null,"Childcare / Playgroup",0]
[null,"Baby Sitting",0]
[null,"Pocket Money",0]
[null,"Children's Clothing",0]
[null,"School Meals",0]
[null,"School Trips",0]
[null,"Children's Leisure",0]
[null,"Maintenance / Child support payments",0]
[null,"School Fees",0]
[null,"Payments to children at University or College",0]
[null,"Children Total:",{"$f":"SUM(C10:C20)","v":0}]

{"sheet":"Savings_&_Giving","index":9,"n_rows":25,"n_cols":3,"rows_kept":25,"cut":false,"hidden":false,"merged":[[7,1,8,1],[7,2,8,2],[20,1,21,1],[20,2,21,2]]}
[]
[null,"Saving & Giving"]
[]
[null,"Please provide details of all money you save and give."]
[]
[null,"Savings & Big Purchases"]
[]
[null,"Description","Amount £"]
[]
[null,"Regular Savings",0]
[null,"ISAs",0]
[null,"Car",0]
[null,"Holiday",0]
[null,"Home",0]
[null,"Education",0]
[null,"Other",0]
[null,"Saving & Big Purchases Total:",{"$f":"SUM(C10:C16)","v":0}]
[]
[null,"Giving"]
[]
[null,"Description","Amount £"]
[]
[null,"Regular Donations",0]
[null,"One-off Donations",0]
[null,"Giving Total:",{"$f":"SUM(C23:C24)","v":0}]

{"sheet":"Miscellaneous","index":10,"n_rows":16,"n_cols":3,"rows_kept":16,"cut":false,"hidden":false,"merged":[[7,1,8,1],[7,2,8,2]]}
[]
[null,"Miscellaneous (incl. Christmas)"]
[]
[null,"Please provide details of all miscellaneous spending including christmas"]
[]
[null,"Miscellaneous & Christmas"]
[]
[null,"Description","Amount £"]
[]
[null,"Birthday presents",0]
[null,"Christmas",0]
[null,"Fines",0]
[null,"Tax & NI provisions (for self-employed only)",0]
[null,"Adult Education classes / costs",0]
[null,"University / College fees",0]
[null,"Miscellaneous & Christmas Total:",{"$f":"SUM(C10:C15)","v":0}]

{"sheet":"Financial_Overview","index":11,"n_rows":23,"n_cols":10,"rows_kept":23,"cut":false,"hidden":false,"merged":[[3,1,4,1],[3,2,4,2],[3,5,4,5],[3,6,4,6]]}
[]
[null,"Income",null,null,null,"Remaining Income"]
[]
[null,"Description","Amount £",null,null,"Description","Amount £"]
[]
[null,"Income (non-benefit)",0,null,null,"Income",{"$f":"C8","v":0}]
[null,"Benefits & Tax Credits",0,null,null,"Expenditure",{"$f":"C23","v":0}]
[null,"Total Income:",{"$f":"SUM(C6:C7)","v":0},null,null,"Remaining Income",{"$f":"G6-G7","v":0}]
[]
[]
[null,"Expenditure",null,null,null,null,null,null,null,"Debt Reduction Calculation"]
[]
[null,"Description","Amount £"]
[null,"Housing & Utilities",0]
[null,"Other household expenditure",0]
[null,"Housekeeping & Health",0]
[null,"Leisure & Clothing",0]
[null,"Travel",0]
[null,"Debts & Loans",0]
[null,"Children",0]
[null,"Savings (incl, Big Purchases) & Giving",0]
[null,"Miscellaneous (incl. Christmas)",0]
[null,"Total Expenditure:",{"$f":"SUM(C14:C22)","v":0}]

{"sheet":"Debt_Reduction_Calculator","index":12,"n_rows":17,"n_cols":7,"rows_kept":17,"cut":false,"hidden":false,"merged":[[0,3,1,4],[3,6,4,6],[3,1,4,1],[3,2,4,2],[3,3,4,3],[3,4,4,4],[3,5,4,5],[11,1,12,1],[11,2,12,2],[11,3,12,3],[11,4,12,4],[11,5,12,5]]}
[null,{"$f":"TODAY()","v":"2016-01-25"},null,"Payment Stratergy:-"]
[]
[]
[null,"Description","Amount £","Interest Rate","Remaining Debt/Loan Balance","Interest Added Per Month","Ranking"]
[null,null,null,null,null,{"$f":"(E5*D5)/12","v":0},2]
[]
[]
[null,"Snowball Payment:-",0]
[]
[]
[]
[null,"Creditors","Original Balance","Interest Paid","Months To Pay Off","Last Payment"]
[]
[]
[]
[]
[null,"Total Interest Paid:-",0]

{"sheet":"Payment_Schedule","index":13,"n_rows":260,"n_cols":46,"rows_kept":260,"cut":false,"hidden":true,"merged":[[4,1,4,2]]}
[]
[]
[]
[]
[null,"Monthly Payment:-"]
[]
[null,null,null,"Creditor:","Credit / Store Card repayments","Hire Purchase / Leasing payments","Car loan repayments","Other unsecured loan repayments","Payments to Reduce Overdraft","Loan repayments for loans secured on your home",{"$f":"IF(ISERROR([1]Order!I66),\"\",IF(ISBLANK(INDEX([1]Calculator!$B$8:$B$17,[1]Order!I66)),\" - \",INDEX([1]Calculator!$B$8:$B$17,[1]Order!I66)))","v":""}]
[null,null,null,"Balance:",null,null,null,null,null,null,0]
[null,null,null,"Rate:",null,null,null,null,null,null,0]
[null,null,null,"Base Payment:",null,null,null,null,null,null,0]
[null,null,null,"Months to Pay Off:",{"$f":"IF(E8>0,1+MAX((ROW(E21:E190)-ROW(E$21))*(E21:E190>0)),0)","v":0},{"$f":"IF(F8>0,1+MAX((ROW(F21:F190)-ROW(F$21))*(F21:F190>0)),0)","v":0},{"$f":"IF(G8>0,1+MAX((ROW(G21:G190)-ROW(G$21))*(G21:G190>0)),0)","v":0},{"$f":"IF(H8>0,1+MAX((ROW(H21:H190)-ROW(H$21))*(H21:H190>0)),0)","v":0},{"$f":"IF(I8>0,1+MAX((ROW(I21:I190)-ROW(I$21))*(I21:I190>0)),0)","v":0},{"$f":"IF(J8>0,1+MAX((ROW(J21:J190)-ROW(J$21))*(J21:J190>0)),0)","v":0},{"$f":"IF(K8>0,1+MAX((ROW(K21:K190)-ROW(K$21))*(K21:K190>0)),0)","v":0}]
[null,null,null,"Month Paid Off:",{"$f":"IF(E8>0,INDEX($B$21:$B$190,E11),\"\")","v":""},"","","","","",""]
[null,null,null,"Total Interest:",{"$f":"IF(E260=0,SUM(V21:V190),NA())","v":0},{"$f":"IF(F260=0,SUM(W21:W190),NA())","v":0},0,0,0,0,0]
[]
[]
[null,null,null,"Total Interest:",{"$f":"SUM(E13:N13)","v":0}]
[]
[null,null,null,"Monthly Payments",null,null,null,null,null,null,null,null,null,null,"Balance AFTER Payment",null,null,null,null,null,null,null,"Interest",null,null,null,null,null,null,null,null,"Payment Before Snowball",null,null,null,null,null,null,null,null,"Extra Payment"]
["No.","Month","Snowball",null,{"$f":"E7","v":"Credit / Store Card repayments"},{"$f":"F7","v":"Hire Purchase / Leasing payments"},"Car loan repayments","Other unsecured loan repayments","Payments to Reduce Overdraft","Loan repayments for loans secured on your home",{"$f":"J7","v":"Loan repayments for loans secured on your home"},null,"END BALANCE",{"$f":"E19","v":"Credit / Store Card repayments"},"Hire Purchase / Leasing payments","Car loan repayments","Other unsecured loan repayments","Payments to Reduce Overdraft","Loan repayments for loans secured on your home","Loan repayments for loans secured on your home",null,{"$f":"E19","v":"Credit / Store Card repayments"},"Hire Purchase / Leasing payments","Car loan repayments","Other unsecured loan repayments","Payments to Reduce Overdraft","Loan repayments for loans secured on your home","Loan repayments for loans secured on your home","TOTAL",null,{"$f":"E19","v":"Credit / Store Card repayments"},"Hire Purchase / Leasing payments","Car loan repayments","Other unsecured loan repayments","Payments to Reduce Overdraft","Loan repayments for loans secured on your home","Loan repayments for loans secured on your home","TOTAL",null,{"$f":"E7","v":"Credit / Store Card repayments"},"Hire Purchase / Leasing payments","Car loan repayments","Other unsecured loan repayments","Payments to Reduce Overdraft","Loan repayments for loans secured on your home",""]
[null,{"$f":"TODAY()","v":"2016-01-25"},null,null,null,null,null,null,null,null,null,null,{"$f":"SUM(N20:T20)","v":0},{"$f":"E8","v":0},0,0,0,0,0,0]
[{"$f":"IF(SUM(N20:T20)<=0,\"\",A20+1)","v":""},{"$f":"IF(A21=\"\",NA(),DATE(YEAR(B20),MONTH(B20)+1,1))","v":{"$error":"#N/A"}},"",null,{"$f":"AE21+AN21","v":0},{"$f":"AF21+AO21","v":0},{"$f":"AG21+AP21","v":0},{"$f":"AH21+AQ21","v":0},{"$f":"AI21+AR21","v":0},{"$f":"AJ21+AS21","v":0},{"$f":"AK21+AT21","v":0},null,0,{"$f":"IF(D$8=0,0,ROUND(N20-(E21-V21),2))","v":0},{"$f":"IF(E$8=0,0,ROUND(O20-(F21-W21),2))","v":0},{"$f":"IF(F$8=0,0,ROUND(P20-(G21-X21),2))","v":0},{"$f":"IF(G$8=0,0,ROUND(Q20-(H21-Y21),2))","v":0},{"$f":"IF(H$8=0,0,ROUND(R20-(I21-Z21),2))","v":0},{"$f":"IF(I$8=0,0,ROUND(S20-(J21-AA21),2))","v":0},{"$f":"IF(J$8=0,0,ROUND(T20-(K21-AB21),2))","v":0},null,{"$f":"ROUND(N20*E$9/12,2)","v":0},{"$f":"ROUND(O20*F$9/12,2)","v":0},{"$f":"ROUND(P20*G$9/12,2)","v":0},{"$f":"ROUND(Q20*H$9/12,2)","v":0},{"$f":"ROUND(R20*I$9/12,2)","v":0},{"$f":"ROUND(S20*J$9/12,2)","v":0},{"$f":"ROUND(T20*K$9/12,2)","v":0},{"$f":"SUM(V21:AB21)","v":0},null,{"$f":"IF(N20>0,IF((N20+V21)<E$10,N20+V21,E$10),0)","v":0},0,0,0,0,0,0,{"$f":"SUM(AE21:AK21)","v":0},null,{"$f":"IF(N20<=0,0,IF(AE21+$C21>N20+V21,N20+V21-AE21,$C21))","v":0},{"$f":"IF(O20<=0,0,IF($C21<=SUM($AN21:AN21),0,IF(AF21+$C21-SUM($AN21:AN21)>O20+W21,O20+W21-AF21,$C21-SUM($AN21:AN21))))","v":0},{"$f":"IF(P20<=0,0,IF($C21<=SUM($AN21:AO21),0,IF(AG21+$C21-SUM($AN21:AO21)>P20+X21,P20+X21-AG21,$C21-SUM($AN21:AO21))))","v":0},{"$f":"IF(Q20<=0,0,IF($C21<=SUM($AN21:AP21),0,IF(AH21+$C21-SUM($AN21:AP21)>Q20+Y21,Q20+Y21-AH21,$C21-SUM($AN21:AP21))))","v":0},{"$f":"IF(R20<=0,0,IF($C21<=SUM($AN21:AQ21),0,IF(AI21+$C21-SUM($AN21:AQ21)>R20+Z21,R20+Z21-AI21,$C21-SUM($AN21:AQ21))))","v":0},{"$f":"IF(S20<=0,0,IF($C21<=SUM($AN21:AR21),0,IF(AJ21+$C21-SUM($AN21:AR21)>S20+AA21,S20+AA21-AJ21,$C21-SUM($AN21:AR21))))","v":0},{"$f":"IF(T20<=0,0,IF($C21<=SUM($AN21:AS21),0,IF(AK21+$C21-SUM($AN21:AS21)>T20+AB21,T20+AB21-AK21,$C21-SUM($AN21:AS21))))","v":0}]
["",{"$f":"IF(A22=\"\",NA(),DATE(YEAR(B21),MONTH(B21)+1,1))","v":{"$error":"#N/A"}},"",null,0,0,0,0,0,0,0,null,0,0,0,0,0,0,0,0,null,0,0,0,0,0,0,0,{"$f":"SUM(V22:AB22)","v":0},null,{"$f":"IF(N21>0,IF((N21+V22)<E$10,N21+V22,E$10),0)","v":0},{"$f":"IF(O21>0,IF((O21+W22)<F$10,O21+W22,F$10),0)","v":0},{"$f":"IF(P21>0,IF((P21+X22)<G$10,P21+X22,G$10),0)","v":0},{"$f":"IF(Q21>0,IF((Q21+Y22)<H$10,Q21+Y22,H$10),0)","v":0},{"$f":"IF(R21>0,IF((R21+Z22)<I$10,R21+Z22,I$10),0)","v":0},{"$f":"IF(S21>0,IF((S21+AA22)<I$10,S21+AA22,I$10),0)","v":0},{"$f":"IF(T21>0,IF((T21+AB22)<#REF!,T21+AB22,#REF!),0)","v":0},0,null,0,{"$f":"IF(O21<=0,0,IF($C22<=SUM($AN22:AN22),0,IF(AF22+$C22-SUM($AN22:AN22)>O21+W22,O21+W22-AF22,$C22-SUM($AN22:AN22))))","v":0},{"$f":"IF(P21<=0,0,IF($C22<=SUM($AN22:AO22),0,IF(AG22+$C22-SUM($AN22:AO22)>P21+X22,P21+X22-AG22,$C22-SUM($AN22:AO22))))","v":0},{"$f":"IF(Q21<=0,0,IF($C22<=SUM($AN22:AP22),0,IF(AH22+$C22-SUM($AN22:AP22)>Q21+Y22,Q21+Y22-AH22,$C22-SUM($AN22:AP22))))","v":0},{"$f":"IF(R21<=0,0,IF($C22<=SUM($AN22:AQ22),0,IF(AI22+$C22-SUM($AN22:AQ22)>R21+Z22,R21+Z22-AI22,$C22-SUM($AN22:AQ22))))","v":0},{"$f":"IF(S21<=0,0,IF($C22<=SUM($AN22:AR22),0,IF(AJ22+$C22-SUM($AN22:AR22)>S21+AA22,S21+AA22-AJ22,$C22-SUM($AN22:AR22))))","v":0},{"$f":"IF(T21<=0,0,IF($C22<=SUM($AN22:AS22),0,IF(AK22+$C22-SUM($AN22:AS22)>T21+AB22,T21+AB22-AK22,$C22-SUM($AN22:AS22))))","v":0}]
["",{"$f":"IF(A23=\"\",NA(),DATE(YEAR(B22),MONTH(B22)+1,1))","v":{"$error":"#N/A"}},"",null,0,0,0,0,0,0,0,null,0,0,0,0,0,0,0,0,null,0,0,0,0,0,0,0,0,null,0,0,0,0,0,0,{"$f":"IF(T22>0,IF((T22+AB23)<#REF!,T22+AB23,#REF!),0)","v":0},0,null,0,{"$f":"IF(O22<=0,0,IF($C23<=SUM($AN23:AN23),0,IF(AF23+$C23-SUM($AN23:AN23)>O22+W23,O22+W23-AF23,$C23-SUM($AN23:AN23))))","v":0},{"$f":"IF(P22<=0,0,IF($C23<=SUM($AN23:AO23),0,IF(AG23+$C23-SUM($AN23:AO23)>P22+X23,P22+X23-AG23,$C23-SUM($AN23:AO23))))","v":0},{"$f":"IF(Q22<=0,0,IF($C23<=SUM($AN23:AP23),0,IF(AH23+$C23-SUM($AN23:AP23)>Q22+Y23,Q22+Y23-AH23,$C23-SUM($AN23:AP23))))","v":0},{"$f":"IF(R22<=0,0,IF($C23<=SUM($AN23:AQ23),0,IF(AI23+$C23-SUM($AN23:AQ23)>R22+Z23,R22+Z23-AI23,$C23-SUM($AN23:AQ23))))","v":0},{"$f":"IF(S22<=0,0,IF($C23<=SUM($AN23:AR23),0,IF(AJ23+$C23-SUM($AN23:AR23)>S22+AA23,S22+AA23-AJ23,$C23-SUM($AN23:AR23))))","v":0},{"$f":"IF(T22<=0,0,IF($C23<=SUM($AN23:AS23),0,IF(AK23+$C23-SUM($AN23:AS23)>T22+AB23,T22+AB23-AK23,$C23-SUM($AN23:AS23))))","v":0}]
["",{"$error":"#N/A"},"",null,0,0,0,0,0,0,0,null,0,0,0,0,0,0,0,0,null,0,0,0,0,0,0,0,0,null,0,0,0,0,0,0,{"$f":"IF(T23>0,IF((T23+AB24)<#REF!,T23+AB24,#REF!),0)","v":0},0,null,0,{"$f":"IF(O23<=0,0,IF($C24<=SUM($AN24:AN24),0,IF(AF24+$C24-SUM($AN24:AN24)>O23+W24,O23+W24-AF24,$C24-SUM($AN24:AN24))))","v":0},{"$f":"IF(P23<=0,0,IF($C24<=SUM($AN24:AO24),0,IF(AG24+$C24-SUM($AN24:AO24)>P23+X24,P23+X24-AG24,$C24-SUM($AN24:AO24))))","v":0},{"$f":"IF(Q23<=0,0,IF($C24<=SUM($AN24:AP24),0,IF(AH24+$C24-SUM($AN24:AP24)>Q23+Y24,Q23+Y24-AH24,$C24-SUM($AN24:AP24))))","v":0},{"$f":"IF(R23<=0,0,IF($C24<=SUM($AN24:AQ24),0,IF(AI24+$C24-SUM($AN24:AQ24)>R23+Z24,R23+Z24-AI24,$C24-SUM($AN24:AQ24))))","v":0},{"$f":"IF(S23<=0,0,IF($C24<=SUM($AN24:AR24),0,IF(AJ24+$C24-SUM($AN24:AR24)>S23+AA24,S23+AA24-AJ24,$C24-SUM($AN24:AR24))))","v":0},{"$f":"IF(T23<=0,0,IF($C24<=SUM($AN24:AS24),0,IF(AK24+$C24-SUM($AN24:AS24)>T23+AB24,T23+AB24-AK24,$C24-SUM($AN24:AS24))))","v":0}]
["",{"$error":"#N/A"},"",null,0,0,0,0,0,0,0,null,0,0,0,0,0,0,0,0,null,0,0,0,0,0,0,0,0,null,0,0,0,0,0,0,{"$f":"IF(T24>0,IF((T24+AB25)<#REF!,T24+AB25,#REF!),0)","v":0},0,null,0,{"$f":"IF(O24<=0,0,IF($C25<=SUM($AN25:AN25),0,IF(AF25+$C25-SUM($AN25:AN25)>O24+W25,O24+W25-AF25,$C25-SUM($AN25:AN25))))","v":0},{"$f":"IF(P24<=0,0,IF($C25<=SUM($AN25:AO25),0,IF(AG25+$C25-SUM($AN25:AO25)>P24+X25,P24+X25-AG25,$C25-SUM($AN25:AO25))))","v":0},{"$f":"IF(Q24<=0,0,IF($C25<=SUM($AN25:AP25),0,IF(AH25+$C25-SUM($AN25:AP25)>Q24+Y25,Q24+Y25-AH25,$C25-SUM($AN25:AP25))))","v":0},{"$f":"IF(R24<=0,0,IF($C25<=SUM($AN25:AQ25),0,IF(AI25+$C25-SUM($AN25:AQ25)>R24+Z25,R24+Z25-AI25,$C25-SUM($AN25:AQ25))))","v":0},{"$f":"IF(S24<=0,0,IF($C25<=SUM($AN25:AR25),0,IF(AJ25+$C25-SUM($AN25:AR25)>S24+AA25,S24+AA25-AJ25,$C25-SUM($AN25:AR25))))","v":0},{"$f":"IF(T24<=0,0,IF($C25<=SUM($AN25:AS25),0,IF(AK25+$C25-SUM($AN25:AS25)>T24+AB25,T24+AB25-AK25,$C25-SUM($AN25:AS25))))","v":0}]
["",{"$error":"#N/A"},"",null,0,0,0,0,0,0,0,null,0,0,0,0,0,0,0,0,null,0,0,0,0,0,0,0,0,null,0,0,0,0,0,0,{"$f":"IF(T25>0,IF((T25+AB26)<#REF!,T25+AB26,#REF!),0)","v":0},0,null,0,{"$f":"IF(O25<=0,0,IF($C26<=SUM($AN26:AN26),0,IF(AF26+$C26-SUM($AN26:AN26)>O25+W26,O25+W26-AF26,$C26-SUM($AN26:AN26))))","v":0},{"$f":"IF(P25<=0,0,IF($C26<=SUM($AN26:AO26),0,IF(AG26+$C26-SUM($AN26:AO26)>P25+X26,P25+X26-AG26,$C26-SUM($AN26:AO26))))","v":0},{"$f":"IF(Q25<=0,0,IF($C26<=SUM($AN26:AP26),0,IF(AH26+$C26-SUM($AN26:AP26)>Q25+Y26,Q25+Y26-AH26,$C26-SUM($AN26:AP26))))","v":0},{"$f":"IF(R25<=0,0,IF($C26<=SUM($AN26:AQ26),0,IF(AI26+$C26-SUM($AN26:AQ26)>R25+Z26,R25+Z26-AI26,$C26-SUM($AN26:AQ26))))","v":0},{"$f":"IF(S25<=0,0,IF($C26<=SUM($AN26:AR26),0,IF(AJ26+$C26-SUM($AN26:AR26)>S25+AA26,S25+AA26-AJ26,$C26-SUM($AN26:AR26))))","v":0},{"$f":"IF(T25<=0,0,IF($C26<=SUM($AN26:AS26),0,IF(AK26+$C26-SUM($AN26:AS26)>T25+AB26,T25+AB26-AK26,$C26-SUM($AN26:AS26))))","v":0}]
["",{"$error":"#N/A"},"",null,0,0,0,0,0,0,0,null,0,0,0,0,0,0,0,0,null,0,0,0,0,0,0,0,0,null,0,0,0,0,0,0,{"$f":"IF(T26>0,IF((T26+AB27)<#REF!,T26+AB27,#REF!),0)","v":0},0,null,0,{"$f":"IF(O26<=0,0,IF($C27<=SUM($AN27:AN27),0,IF(AF27+$C27-SUM($AN27:AN27)>O26+W27,O26+W27-AF27,$C27-SUM($AN27:AN27))))","v":0},{"$f":"IF(P26<=0,0,IF($C27<=SUM($AN27:AO27),0,IF(AG27+$C27-SUM($AN27:AO27)>P26+X27,P26+X27-AG27,$C27-SUM($AN27:AO27))))","v":0},{"$f":"IF(Q26<=0,0,IF($C27<=SUM($AN27:AP27),0,IF(AH27+$C27-SUM($AN27:AP27)>Q26+Y27,Q26+Y27-AH27,$C27-SUM($AN27:AP27))))","v":0},{"$f":"IF(R26<=0,0,IF($C27<=SUM($AN27:AQ27),0,IF(AI27+$C27-SUM($AN27:AQ27)>R26+Z27,R26+Z27-AI27,$C27-SUM($AN27:AQ27))))","v":0},{"$f":"IF(S26<=0,0,IF($C27<=SUM($AN27:AR27),0,IF(AJ27+$C27-SUM($AN27:AR27)>S26+AA27,S26+AA27-AJ27,$C27-SUM($AN27:AR27))))","v":0},{"$f":"IF(T26<=0,0,IF($C27<=SUM($AN27:AS27),0,IF(AK27+$C27-SUM($AN27:AS27)>T26+AB27,T26+AB27-AK27,$C27-SUM($AN27:AS27))))","v":0}]
["",{"$error":"#N/A"},"",null,0,0,0,0,0,0,0,null,0,0,0,0,0,0,0,0,null,0,0,0,0,0,0,0,0,null,0,0,0,0,0,0,{"$f":"IF(T27>0,IF((T27+AB28)<#REF!,T27+AB28,#REF!),0)","v":0},0,null,0,{"$f":"IF(O27<=0,0,IF($C28<=SUM($AN28:AN28),0,IF(AF28+$C28-SUM($AN28:AN28)>O27+W28,O27+W28-AF28,$C28-SUM($AN28:AN28))))","v":0},{"$f":"IF(P27<=0,0,IF($C28<=SUM($AN28:AO28),0,IF(AG28+$C28-SUM($AN28:AO28)>P27+X28,P27+X28-AG28,$C28-SUM($AN28:AO28))))","v":0},{"$f":"IF(Q27<=0,0,IF($C28<=SUM($AN28:AP28),0,IF(AH28+$C28-SUM($AN28:AP28)>Q27+Y28,Q27+Y28-AH28,$C28-SUM($AN28:AP28))))","v":0},{"$f":"IF(R27<=0,0,IF($C28<=SUM($AN28:AQ28),0,IF(AI28+$C28-SUM($AN28:AQ28)>R27+Z28,R27+Z28-AI28,$C28-SUM($AN28:AQ28))))","v":0},{"$f":"IF(S27<=0,0,IF($C28<=SUM($AN28:AR28),0,IF(AJ28+$C28-SUM($AN28:AR28)>S27+AA28,S27+AA28-AJ28,$C28-SUM($AN28:AR28))))","v":0},{"$f":"IF(T27<=0,0,IF($C28<=SUM($AN28:AS28),0,IF(AK28+$C28-SUM($AN28:AS28)>T27+AB28,T27+AB28-AK28,$C28-SUM($AN28:AS28))))","v":0}]
["",{"$error":"#N/A"},"",null,0,0,0,0,0,0,0,null,0,0,0,0,0,0,0,0,null,0,0,0,0,0,0,0,0,null,0,0,0,0,0,0,{"$f":"IF(T28>0,IF((T28+AB29)<#REF!,T28+AB29,#REF!),0)","v":0},0,null,0,{"$f":"IF(O28<=0,0,IF($C29<=SUM($AN29:AN29),0,IF(AF29+$C29-SUM($AN29:AN29)>O28+W29,O28+W29-AF29,$C29-SUM($AN29:AN29))))","v":0},{"$f":"IF(P28<=0,0,IF($C29<=SUM($AN29:AO29),0,IF(AG29+$C29-SUM($AN29:AO29)>P28+X29,P28+X29-AG29,$C29-SUM($AN29:AO29))))","v":0},{"$f":"IF(Q28<=0,0,IF($C29<=SUM($AN29:AP29),0,IF(AH29+$C29-SUM($AN29:AP29)>Q28+Y29,Q28+Y29-AH29,$C29-SUM($AN29:AP29))))","v":0},{"$f":"IF(R28<=0,0,IF($C29<=SUM($AN29:AQ29),0,IF(AI29+$C29-SUM($AN29:AQ29)>R28+Z29,R28+Z29-AI29,$C29-SUM($AN29:AQ29))))","v":0},{"$f":"IF(S28<=0,0,IF($C29<=SUM($AN29:AR29),0,IF(AJ29+$C29-SUM($AN29:AR29)>S28+AA29,S28+AA29-AJ29,$C29-SUM($AN29:AR29))))","v":0},{"$f":"IF(T28<=0,0,IF($C29<=SUM($AN29:AS29),0,IF(AK29+$C29-SUM($AN29:AS29)>T28+AB29,T28+AB29-AK29,$C29-SUM($AN29:AS29))))","v":0}]
["",{"$error":"#N/A"},"",null,0,0,0,0,0,0,0,null,0,0,0,0,0,0,0,0,null,0,0,0,0,0,0,0,0,null,0,0,0,0,0,0,{"$f":"IF(T29>0,IF((T29+AB30)<#REF!,T29+AB30,#REF!),0)","v":0},0,null,0,{"$f":"IF(O29<=0,0,IF($C30<=SUM($AN30:AN30),0,IF(AF30+$C30-SUM($AN30:AN30)>O29+W30,O29+W30-AF30,$C30-SUM($AN30:AN30))))","v":0},{"$f":"IF(P29<=0,0,IF($C30<=SUM($AN30:AO30),0,IF(AG30+$C30-SUM($AN30:AO30)>P29+X30,P29+X30-AG30,$C30-SUM($AN30:AO30))))","v":0},{"$f":"IF(Q29<=0,0,IF($C30<=SUM($AN30:AP30),0,IF(AH30+$C30-SUM($AN30:AP30)>Q29+Y30,Q29+Y30-AH30,$C30-SUM($AN30:AP30))))","v":0},{"$f":"IF(R29<=0,0,IF($C30<=SUM($AN30:AQ30),0,IF(AI30+$C30-SUM($AN30:AQ30)>R29+Z30,R29+Z30-AI30,$C30-SUM($AN30:AQ30))))","v":0},{"$f":"IF(S29<=0,0,IF($C30<=SUM($AN30:AR30),0,IF(AJ30+$C30-SUM($AN30:AR30)>S29+AA30,S29+AA30-AJ30,$C30-SUM($AN30:AR30))))","v":0},{"$f":"IF(T29<=0,0,IF($C30<=SUM($AN30:AS30),0,IF(AK30+$C30-SUM($AN30:AS30)>T29+AB30,T29+AB30-AK30,$C30-SUM($AN30:AS30))))","v":0}]
{"$rows_left_out":230}